Reaction Details
TargetDihydrofolate reductase
LigandBDBM50041929
Substrate/Competitorn/a
Meas. Tech.ChEMBL_53494 (CHEMBL665618)
IC50 130±n/a nM
Citation Rosowsky, AMota, CEWright, JEFreisheim, JHHeusner, JJMcCormack, JJQueener, SF 2,4-Diaminothieno[2,3-d]pyrimidine analogues of trimetrexate and piritrexim as potential inhibitors of Pneumocystis carinii and Toxoplasma gondii dihydrofolate reductase. J Med Chem36:3103-12 (1993) Dihydrofolate reductase
Name:Dihydrofolate reductase
Type:Enzyme
Mol. Mass.:17991.61
Organism:Escherichia coli
Description:E. coli DHFR was expressed in BL21, and purified to homogeneity.
Residue:159
BDBM50041929
NameBDBM50041929
Synonyms:6-(2,5-Dimethoxy-phenyl)-5-methyl-thieno[2,3-d]pyrimidine-2,4-diamine CHEMBL323960
TypeSmall organic molecule
Emp. Form.C15H16N4O2S
Mol. Mass.316.378
SMILESCOc1ccc(OC)c(c1)-c1sc2nc(N)nc(N)c2c1C