Reaction Details
TargetLeukotriene B4 receptor 1
LigandBDBM50042180
Substrate/Competitorn/a
Meas. Tech.ChEBML_153299
Ki 1±n/a nM
Citation Daines, RAChambers, PAPendrak, IJakas, DRSarau, HMFoley, JJSchmidt, DBKingsbury, WD Trisubstituted pyridine leukotriene B4 receptor antagonists: synthesis and structure-activity relationships. J Med Chem36:3321-32 (1993) Leukotriene B4 receptor 1
Name:Leukotriene B4 receptor 1
Type:Enzyme Catalytic Domain
Mol. Mass.:37582.68
Organism:Homo sapiens (Human)
Description:Q15722
Residue:352
BDBM50042180
NameBDBM50042180
Synonyms:3-{1-Hydroxy-2-[6-(3-hydroxy-undec-1-enyl)-pyridin-2-yl]-ethyl}-benzoic acid | CHEMBL112487
TypeSmall organic molecule
Emp. Form.C25H33NO4
Mol. Mass.411.5338
SMILESCCCCCCCCC(O)\C=C\c1cccc(CC(O)c2cccc(c2)C(O)=O)n1