Reaction Details
TargetLeukotriene B4 receptor 1
LigandBDBM50042185
Substrate/Competitorn/a
Meas. Tech.ChEBML_99828
Ki 3500±n/a nM
Citation Boehm, JCGleason, JGPendrak, ISarau, HMSchmidt, DBFoley, JJKingsbury, WD Synthesis and LTB4 receptor antagonist activities of the naturally occurring LTB4 receptor antagonist Leucettamine A and related analogues. J Med Chem36:3333-40 (1993) Leukotriene B4 receptor 1
Name:Leukotriene B4 receptor 1
Type:Enzyme Catalytic Domain
Mol. Mass.:37582.68
Organism:Homo sapiens (Human)
Description:Q15722
Residue:352
BDBM50042185
NameBDBM50042185
Synonyms:4,5-Bis-benzo[1,3]dioxol-5-ylmethyl-1-methyl-1H-imidazol-2-ylamine leucettamine A
TypeSmall organic molecule
Emp. Form.C20H19N3O4
Mol. Mass.365.3826
SMILESCn1c(N)nc(Cc2ccc3OCOc3c2)c1Cc1ccc2OCOc2c1