Reaction Details
TargetLeukotriene B4 receptor 1
LigandBDBM50042188
Substrate/Competitorn/a
Meas. Tech.ChEBML_99828
Ki 9000±n/a nM
Citation Boehm, JCGleason, JGPendrak, ISarau, HMSchmidt, DBFoley, JJKingsbury, WD Synthesis and LTB4 receptor antagonist activities of the naturally occurring LTB4 receptor antagonist Leucettamine A and related analogues. J Med Chem36:3333-40 (1993) Leukotriene B4 receptor 1
Name:Leukotriene B4 receptor 1
Type:Enzyme Catalytic Domain
Mol. Mass.:37582.68
Organism:Homo sapiens (Human)
Description:Q15722
Residue:352
BDBM50042188
NameBDBM50042188
Synonyms:4,5-Dibenzyl-1H-imidazol-2-ylamine | CHEMBL116278
TypeSmall organic molecule
Emp. Form.C17H17N3
Mol. Mass.263.337
SMILESNc1nc(Cc2ccccc2)c(Cc2ccccc2)[nH]1