Reaction Details
TargetThymidylate synthase
LigandBDBM50042378
Substrate/Competitorn/a
Meas. Tech.ChEMBL_209654 (CHEMBL811594)
Ki 2.5±n/a nM
Citation Pendergast, WDickerson, SHJohnson, JVDev, IKFerone, RDuch, DSSmith, GK Benzoquinazoline inhibitors of thymidylate synthase: enzyme inhibitory activity and cytotoxicity of some sulfonamidobenzoylglutamate and related derivatives. J Med Chem36:3464-71 (1993) Thymidylate synthase
Name:Thymidylate synthase
Type:Enzyme
Mol. Mass.:35718.07
Organism:Homo sapiens (Human)
Description:n/a
Residue:313
BDBM50042378
NameBDBM50042378
Synonyms:2-[4-(3-Amino-1-oxo-1,2,5,6-tetrahydro-benzo[f]quinazoline-9-sulfonylamino)-benzoylamino]-pentanedioic acid | CHEMBL325972
TypeSmall organic molecule
Emp. Form.C24H23N5O8S
Mol. Mass.541.533
SMILESNc1nc2CCc3ccc(cc3-c2c(=O)[nH]1)S(=O)(=O)Nc1ccc(cc1)C(=O)N[C@@H](CCC(O)=O)C(O)=O