Reaction Details
TargetCalpain-2 catalytic subunit
LigandBDBM50042421
Substrate/Competitorn/a
Meas. Tech.ChEBML_43855
pH8±n/a
Ki 200±n/a nM
Commentsextracted
Citation Li, ZPatil, GSGolubski, ZEHori, HTehrani, KForeman, JEEveleth, DDBartus, RTPowers, JC Peptide alpha-keto ester, alpha-keto amide, and alpha-keto acid inhibitors of calpains and other cysteine proteases. J Med Chem36:3472-80 (1993) Calpain-2 catalytic subunit
Name:Calpain-2 catalytic subunit
Type:Protein
Mol. Mass.:79965.18
Organism:Homo sapiens (Human)
Description:n/a
Residue:700
BDBM50042421
NameBDBM50042421
Synonyms:3-(2-Diphenylacetylamino-4-methyl-pentanoylamino)-2-oxo-pentanoic acid ethyl ester | CHEMBL117776
TypeSmall organic molecule
Emp. Form.C27H34N2O5
Mol. Mass.466.5693
SMILESCCOC(=O)C(=O)C(CC)NC(=O)C(CC(C)C)NC(=O)C(c1ccccc1)c1ccccc1