Reaction Details
TargetCalpain-2 catalytic subunit
LigandBDBM50042419
Substrate/Competitorn/a
Meas. Tech.ChEBML_43855
pH8±n/a
Ki 50±n/a nM
Commentsextracted
Citation Li, ZPatil, GSGolubski, ZEHori, HTehrani, KForeman, JEEveleth, DDBartus, RTPowers, JC Peptide alpha-keto ester, alpha-keto amide, and alpha-keto acid inhibitors of calpains and other cysteine proteases. J Med Chem36:3472-80 (1993) Calpain-2 catalytic subunit
Name:Calpain-2 catalytic subunit
Type:Protein
Mol. Mass.:79965.18
Organism:Homo sapiens (Human)
Description:n/a
Residue:700
BDBM50042419
NameBDBM50042419
Synonyms:CHEMBL116477 | [1-(1-Benzyl-2-oxo-2-propylcarbamoyl-ethylcarbamoyl)-3-methyl-butyl]-carbamic acid benzyl ester
TypeSmall organic molecule
Emp. Form.C27H35N3O5
Mol. Mass.481.5839
SMILESCCCNC(=O)C(=O)C(Cc1ccccc1)NC(=O)C(CC(C)C)NC(=O)OCc1ccccc1