Reaction Details
TargetCalpain-2 catalytic subunit
LigandBDBM50042389
Substrate/Competitorn/a
Meas. Tech.ChEBML_43855
pH8±n/a
Ki 90±n/a nM
Commentsextracted
Citation Li, ZPatil, GSGolubski, ZEHori, HTehrani, KForeman, JEEveleth, DDBartus, RTPowers, JC Peptide alpha-keto ester, alpha-keto amide, and alpha-keto acid inhibitors of calpains and other cysteine proteases. J Med Chem36:3472-80 (1993) Calpain-2 catalytic subunit
Name:Calpain-2 catalytic subunit
Type:Protein
Mol. Mass.:79965.18
Organism:Homo sapiens (Human)
Description:n/a
Residue:700
BDBM50042389
NameBDBM50042389
Synonyms:3-(4-Methyl-2-{4-methyl-2-[(naphthalene-2-carbonyl)-amino]-pentanoylamino}-pentanoylamino)-2-oxo-pentanoic acid ethyl ester | CHEMBL3142937
TypeSmall organic molecule
Emp. Form.C30H41N3O6
Mol. Mass.539.663
SMILESCCOC(=O)C(=O)[C@H](CC)NC(=O)[C@H](CC(C)C)NC(=O)[C@H](CC(C)C)NC(=O)c1ccc2ccccc2c1