Reaction Details
TargetCalpain-2 catalytic subunit
LigandBDBM50042437
Substrate/Competitorn/a
Meas. Tech.ChEBML_43855
pH8±n/a
Ki 400±n/a nM
Commentsextracted
Citation Li, ZPatil, GSGolubski, ZEHori, HTehrani, KForeman, JEEveleth, DDBartus, RTPowers, JC Peptide alpha-keto ester, alpha-keto amide, and alpha-keto acid inhibitors of calpains and other cysteine proteases. J Med Chem36:3472-80 (1993) Calpain-2 catalytic subunit
Name:Calpain-2 catalytic subunit
Type:Protein
Mol. Mass.:79965.18
Organism:Homo sapiens (Human)
Description:n/a
Residue:700
BDBM50042437
NameBDBM50042437
Synonyms:3-(2-Benzyloxycarbonylamino-4-methyl-pentanoylamino)-4-(4-chloro-phenyl)-2-oxo-butyric acid ethyl ester | CHEMBL117232
TypeSmall organic molecule
Emp. Form.C26H31ClN2O6
Mol. Mass.502.987
SMILESCCOC(=O)C(=O)C(Cc1ccc(Cl)cc1)NC(=O)C(CC(C)C)NC(=O)OCc1ccccc1