Reaction Details
TargetCalpain-2 catalytic subunit
LigandBDBM50042387
Substrate/Competitorn/a
Meas. Tech.ChEBML_43855
pH8±n/a
Ki 22±n/a nM
Commentsextracted
Citation Li, ZPatil, GSGolubski, ZEHori, HTehrani, KForeman, JEEveleth, DDBartus, RTPowers, JC Peptide alpha-keto ester, alpha-keto amide, and alpha-keto acid inhibitors of calpains and other cysteine proteases. J Med Chem36:3472-80 (1993) Calpain-2 catalytic subunit
Name:Calpain-2 catalytic subunit
Type:Protein
Mol. Mass.:79965.18
Organism:Homo sapiens (Human)
Description:n/a
Residue:700
BDBM50042387
NameBDBM50042387
Synonyms:3-(2-Benzyloxycarbonylamino-4-methyl-pentanoylamino)-2-oxo-pentanoic acid | CHEMBL118908
TypeSmall organic molecule
Emp. Form.C19H26N2O6
Mol. Mass.378.4195
SMILESCCC(NC(=O)C(CC(C)C)NC(=O)OCc1ccccc1)C(=O)C(O)=O