Reaction Details
TargetPapain
LigandBDBM50042387
Substrate/Competitorn/a
Meas. Tech.ChEBML_152654
pH6±n/a
Ki 13500±n/a nM
Commentsextracted
Citation Li, ZPatil, GSGolubski, ZEHori, HTehrani, KForeman, JEEveleth, DDBartus, RTPowers, JC Peptide alpha-keto ester, alpha-keto amide, and alpha-keto acid inhibitors of calpains and other cysteine proteases. J Med Chem36:3472-80 (1993) Papain
Name:Papain
Type:Enzyme
Mol. Mass.:38923.01
Organism:Carica papaya
Description:Papain was purchased from Sigma, Germany.
Residue:345
BDBM50042387
NameBDBM50042387
Synonyms:3-(2-Benzyloxycarbonylamino-4-methyl-pentanoylamino)-2-oxo-pentanoic acid | CHEMBL118908
TypeSmall organic molecule
Emp. Form.C19H26N2O6
Mol. Mass.378.4195
SMILESCCC(NC(=O)C(CC(C)C)NC(=O)OCc1ccccc1)C(=O)C(O)=O