Reaction Details
TargetCathepsin B
LigandBDBM50042397
Substrate/Competitorn/a
Meas. Tech.ChEBML_47386
pH5.2±n/a
Ki 4500±n/a nM
Commentsextracted
Citation Li, ZPatil, GSGolubski, ZEHori, HTehrani, KForeman, JEEveleth, DDBartus, RTPowers, JC Peptide alpha-keto ester, alpha-keto amide, and alpha-keto acid inhibitors of calpains and other cysteine proteases. J Med Chem36:3472-80 (1993) Cathepsin B
Name:Cathepsin B
Type:Enzyme
Mol. Mass.:36657.87
Organism:Bos taurus (bovine)
Description:Bovine spleen CB was purchased from Sigma Co. (USA).
Residue:335
BDBM50042397
NameBDBM50042397
Synonyms:3-(2-Benzyloxycarbonylamino-4-methyl-pentanoylamino)-2-oxo-4-phenyl-butyric acid | CHEMBL117023
TypeSmall organic molecule
Emp. Form.C24H28N2O6
Mol. Mass.440.4889
SMILESCC(C)CC(NC(=O)OCc1ccccc1)C(=O)NC(Cc1ccccc1)C(=O)C(O)=O