Reaction Details
TargetPapain
LigandBDBM50042427
Substrate/Competitorn/a
Meas. Tech.ChEBML_152654
pH6±n/a
Ki 38000±n/a nM
Commentsextracted
Citation Li, ZPatil, GSGolubski, ZEHori, HTehrani, KForeman, JEEveleth, DDBartus, RTPowers, JC Peptide alpha-keto ester, alpha-keto amide, and alpha-keto acid inhibitors of calpains and other cysteine proteases. J Med Chem36:3472-80 (1993) Papain
Name:Papain
Type:Enzyme
Mol. Mass.:38923.01
Organism:Carica papaya
Description:Papain was purchased from Sigma, Germany.
Residue:345
BDBM50042427
NameBDBM50042427
Synonyms:CHEMBL118025 | [1-(1-Benzylaminooxalyl-propylcarbamoyl)-3-methyl-butyl]-carbamic acid benzyl ester
TypeSmall organic molecule
Emp. Form.C26H33N3O5
Mol. Mass.467.5573
SMILESCCC(NC(=O)C(CC(C)C)NC(=O)OCc1ccccc1)C(=O)C(=O)NCc1ccccc1