Reaction Details
TargetCalpain small subunit 1/1 catalytic subunit
LigandBDBM50042421
Substrate/Competitorn/a
Meas. Tech.ChEMBL_43671 (CHEMBL656204)
Ki 100±n/a nM
Citation Li, ZPatil, GSGolubski, ZEHori, HTehrani, KForeman, JEEveleth, DDBartus, RTPowers, JC Peptide alpha-keto ester, alpha-keto amide, and alpha-keto acid inhibitors of calpains and other cysteine proteases. J Med Chem36:3472-80 (1993) Calpain small subunit 1/1 catalytic subunit
Name:Calpain small subunit 1/1 catalytic subunit
Type:n/a
Mol. Mass.:n/a
Description:ASSAY_ID of EBI is 43671
Components:This complex has 2 components.
Component 1
Name:Calpain small subunit 1
Synonyms:CAPN4 CAPNS1 Calpain 1
Type:PROTEIN
Mol. Mass.:28309.36
Organism:Homo sapiens (Human)
Description:EBI_12682
Residue:268
Component 2
Name:Calpain-1 catalytic subunit
Synonyms:CAN1_HUMAN CAPN1 Calpain-1 (u-Calpain) Calpain1
Type:Protein
Mol. Mass.:81880.51
Organism:Homo sapiens (Human)
Description:n/a
Residue:714
BDBM50042421
NameBDBM50042421
Synonyms:3-(2-Diphenylacetylamino-4-methyl-pentanoylamino)-2-oxo-pentanoic acid ethyl ester | CHEMBL117776
TypeSmall organic molecule
Emp. Form.C27H34N2O5
Mol. Mass.466.5693
SMILESCCOC(=O)C(=O)C(CC)NC(=O)C(CC(C)C)NC(=O)C(c1ccccc1)c1ccccc1