Reaction Details
TargetCathepsin B
LigandBDBM50042414
Substrate/Competitorn/a
Meas. Tech.ChEBML_47386
pH5.2±n/a
Ki 200±n/a nM
Commentsextracted
Citation Li, ZPatil, GSGolubski, ZEHori, HTehrani, KForeman, JEEveleth, DDBartus, RTPowers, JC Peptide alpha-keto ester, alpha-keto amide, and alpha-keto acid inhibitors of calpains and other cysteine proteases. J Med Chem36:3472-80 (1993) Cathepsin B
Name:Cathepsin B
Type:Enzyme
Mol. Mass.:36657.87
Organism:Bos taurus (bovine)
Description:Bovine spleen CB was purchased from Sigma Co. (USA).
Residue:335
BDBM50042414
NameBDBM50042414
Synonyms:CHEMBL119622 | {3-Methyl-1-[1-(3-phenyl-propylaminooxalyl)-propylcarbamoyl]-butyl}-carbamic acid benzyl ester
TypeSmall organic molecule
Emp. Form.C28H37N3O5
Mol. Mass.495.6105
SMILESCCC(NC(=O)C(CC(C)C)NC(=O)OCc1ccccc1)C(=O)C(=O)NCCCc1ccccc1