Reaction Details
Target5-hydroxytryptamine receptor 3A/3B
LigandBDBM50042711
Substrate/Competitorn/a
Meas. Tech.ChEMBL_3003 (CHEMBL619793)
Ki 0.640±n/a nM
Citation van Wijngaarden, IHamminga, Dvan Hes, RStandaar, PJTipker, JTulp, MTMol, FOlivier, Bde Jonge, A Development of high-affinity 5-HT3 receptor antagonists. Structure-affinity relationships of novel 1,7-annelated indole derivatives. J Med Chem36:3693-9 (1994) 5-hydroxytryptamine receptor 3A/3B
Name:5-hydroxytryptamine receptor 3A/3B
Type:n/a
Mol. Mass.:n/a
Description:ASSAY_ID of EBI is 2974
Components:This complex has 2 components.
Component 1
Name:5-hydroxytryptamine receptor 3B
Synonyms:5HT3B_RAT Serotonin (5-HT) receptor
Type:PROTEIN
Mol. Mass.:50328.78
Organism:Rattus norvegicus
Description:EBI_11885
Residue:437
Component 2
Name:5-hydroxytryptamine receptor 3A
Synonyms:5-HT3 5HT3A_RAT Htr3 Serotonin (5-HT) receptor | Zacopride site-R
Type:Enzyme Catalytic Domain
Mol. Mass.:55428.70
Organism:RAT
Description:5-HT3 HTR3A RAT::P35563
Residue:483
BDBM50042711
NameBDBM50042711
Synonyms:11-(2-Methyl-imidazol-1-ylmethyl)-4,5,6,7,10,11-hexahydro-9H-azepino[3,2,1-jk]carbazol-12-one | CHEMBL332767
TypeSmall organic molecule
Emp. Form.C21H23N3O
Mol. Mass.333.4268
SMILESCc1nccn1CC1CCc2c(C1=O)c1cccc3CCCCn2c13