Reaction Details
TargetType-1 angiotensin II receptor
LigandBDBM50042739
Substrate/Competitorn/a
Meas. Tech.ChEBML_34644
IC50 0.530000±n/a nM
Citation Dhanoa, DSBagley, SWChang, RSLotti, VJChen, TBKivlighn, SDZingaro, GJSiegl, PKChakravarty, PKPatchett, AA (Dipropylphenoxy)phenylacetic acids: a new generation of nonpeptide angiotensin II receptor antagonists. J Med Chem36:3738-42 (1994) Type-1 angiotensin II receptor
Name:Type-1 angiotensin II receptor
Type:Enzyme Catalytic Domain
Mol. Mass.:41009.15
Organism:RABBIT
Description:ANGIOTENSIN AT1 AGTR1 RABBIT::P34976
Residue:359
BDBM50042739
NameBDBM50042739
Synonyms:(2-Chloro-phenyl)-[4-(2-ethyl-5,7-dimethyl-imidazo[4,5-b]pyridin-3-ylmethyl)-2,6-dipropyl-phenoxy]-acetic acid | CHEMBL123084
TypeSmall organic molecule
Emp. Form.C31H36ClN3O3
Mol. Mass.534.089
SMILESCCCc1cc(Cn2c(CC)nc3c(C)cc(C)nc23)cc(CCC)c1OC(C(O)=O)c1ccccc1Cl