Reaction Details
TargetDelta-type opioid receptor
LigandBDBM50042761
Substrate/Competitorn/a
Meas. Tech.ChEBML_147043
Ki 2.9±n/a nM
Citation Salvadori, SBryant, SDBianchi, CBalboni, GScaranari, VAttila, MLazarus, LH Phe3-substituted analogues of deltorphin C. Spatial conformation and topography of the aromatic ring in peptide recognition by delta opioid receptors. J Med Chem36:3748-56 (1994) Delta-type opioid receptor
Name:Delta-type opioid receptor
Type:G Protein-Coupled Receptor (GPCR)
Mol. Mass.:40465.04
Organism:Rattus norvegicus (rat)
Description:Competition binding assays were using CHO-K1 cell membranes expressing the opioid receptor.
Residue:372
BDBM50042761
NameBDBM50042761
Synonyms:CHEMBL340909 | H-Tyr-D-Ala-Phg-Asp-Val-Val-Gly-NH2
TypeSmall organic molecule
Emp. Form.C36H50N8O10
Mol. Mass.754.8298
SMILESCC(C)[C@H](NC(=O)[C@@H](NC(=O)[C@H](CC(O)=O)NC(=O)[C@@H](NC(=O)[C@@H](C)NC(=O)[C@@H](N)Cc1ccc(O)cc1)c1ccccc1)C(C)C)C(=O)NCC(N)=O