Reaction Details
TargetRenin
LigandBDBM50005417
Substrate/Competitorn/a
Meas. Tech.ChEMBL_196281 (CHEMBL806635)
IC50 0.100000±n/a nM
Citation Lunney, EAHamilton, HWHodges, JCKaltenbronn, JSRepine, JTBadasso, MCooper, JBDealwis, CWallace, BALowther, WT Analyses of ligand binding in five endothiapepsin crystal complexes and their use in the design and evaluation of novel renin inhibitors. J Med Chem36:3809-20 (1994) Renin
Name:Renin
Type:Enzyme
Mol. Mass.:45058.99
Organism:Homo sapiens (Human)
Description:n/a
Residue:406
BDBM50005417
NameBDBM50005417
Synonyms:CHEMBL266334 | N-[(1-Cyclohexylmethyl-2,3-dihydroxy-5-methyl-hexylcarbamoyl)-ethylsulfanyl-methyl]-2-(morpholine-4-sulfonylamino)-3-phenyl-propionamide
TypeSmall organic molecule
Emp. Form.C31H52N4O7S2
Mol. Mass.656.897
SMILESCCSC(NC(=O)[C@H](Cc1ccccc1)NS(=O)(=O)N1CCOCC1)C(=O)N[C@@H](CC1CCCCC1)[C@@H](O)[C@@H](O)CC(C)C