Reaction Details
TargetPolyunsaturated fatty acid 5-lipoxygenase
LigandBDBM50042979
Substrate/Competitorn/a
Meas. Tech.ChEBML_3921
IC50 4.2±n/a nM
Citation Sogawa, SNihro, YUeda, HIzumi, AMiki, TMatsumoto, HSatoh, T 3,4-Dihydroxychalcones as potent 5-lipoxygenase and cyclooxygenase inhibitors. J Med Chem36:3904-9 (1994) Polyunsaturated fatty acid 5-lipoxygenase
Name:Polyunsaturated fatty acid 5-lipoxygenase
Type:PROTEIN
Mol. Mass.:78082.31
Organism:Rattus norvegicus
Description:ChEMBL_1432947
Residue:673
BDBM50042979
NameBDBM50042979
Synonyms:3-(3,4-Dihydroxy-phenyl)-1-(3-hydroxy-phenyl)-propenone | CHEMBL126669
TypeSmall organic molecule
Emp. Form.C15H12O4
Mol. Mass.256.2534
SMILESOc1cccc(c1)C(=O)\C=C\c1ccc(O)c(O)c1