Reaction Details
TargetPolyunsaturated fatty acid 5-lipoxygenase
LigandBDBM50042949
Substrate/Competitorn/a
Meas. Tech.ChEBML_3921
IC50 4.6±n/a nM
Citation Sogawa, SNihro, YUeda, HIzumi, AMiki, TMatsumoto, HSatoh, T 3,4-Dihydroxychalcones as potent 5-lipoxygenase and cyclooxygenase inhibitors. J Med Chem36:3904-9 (1994) Polyunsaturated fatty acid 5-lipoxygenase
Name:Polyunsaturated fatty acid 5-lipoxygenase
Type:PROTEIN
Mol. Mass.:78082.31
Organism:Rattus norvegicus
Description:ChEMBL_1432947
Residue:673
BDBM50042949
NameBDBM50042949
Synonyms:(E)-1-(2,4-dihydroxyphenyl)-3-(3,4-dihydroxyphenyl)-2-propen-1-one (21) (E)-3-(3,4-Dihydroxy-phenyl)-1-(2,4-dihydroxy-phenyl)-propenone 3-(3,4-Dihydroxy-phenyl)-1-(2,4-dihydroxy-phenyl)-propenone CHEMBL128000
TypeSmall organic molecule
Emp. Form.C15H12O5
Mol. Mass.272.2528
SMILESOc1ccc(C(=O)\C=C\c2ccc(O)c(O)c2)c(O)c1