Reaction Details
TargetLeukotriene B4 receptor 1
LigandBDBM50029460
Substrate/Competitorn/a
Meas. Tech.ChEMBL_99841 (CHEMBL706760)
Ki 36.0±n/a nM
Citation Sawyer, JSBaldwin, RFSofia, MJFloreancig, PMarder, PSaussy, DLFroelich, LLSilbaugh, SAStengel, PWCockerham, SL Biphenylyl-substituted xanthones: highly potent leukotriene B4 receptor antagonists. J Med Chem36:3982-4 (1994) Leukotriene B4 receptor 1
Name:Leukotriene B4 receptor 1
Type:Enzyme Catalytic Domain
Mol. Mass.:37582.68
Organism:Homo sapiens (Human)
Description:Q15722
Residue:352
BDBM50029460
NameBDBM50029460
Synonyms:3-{3-[3-(5-Ethyl-4'-fluoro-2-hydroxy-biphenyl-4-yloxy)-propoxy]-9-oxo-9H-xanthen-4-yl}-propionic acid | CHEMBL129463
TypeSmall organic molecule
Emp. Form.C33H29FO7
Mol. Mass.556.5776
SMILESCCc1cc(c(O)cc1OCCCOc1ccc2c(oc3ccccc3c2=O)c1CCC(O)=O)-c1ccc(F)cc1