Reaction Details
TargetLeukotriene B4 receptor 1
LigandBDBM50029448
Substrate/Competitorn/a
Meas. Tech.ChEMBL_99841 (CHEMBL706760)
Ki 22±n/a nM
Citation Sawyer, JSBaldwin, RFSofia, MJFloreancig, PMarder, PSaussy, DLFroelich, LLSilbaugh, SAStengel, PWCockerham, SL Biphenylyl-substituted xanthones: highly potent leukotriene B4 receptor antagonists. J Med Chem36:3982-4 (1994) Leukotriene B4 receptor 1
Name:Leukotriene B4 receptor 1
Type:Enzyme Catalytic Domain
Mol. Mass.:37582.68
Organism:Homo sapiens (Human)
Description:Q15722
Residue:352
BDBM50029448
NameBDBM50029448
Synonyms:3-{3-[3-(5-Ethyl-2-hydroxy-biphenyl-4-yloxy)-propoxy]-9-oxo-9H-xanthen-4-yl}-propionic acid | CHEMBL129272
TypeSmall organic molecule
Emp. Form.C33H30O7
Mol. Mass.538.5871
SMILESCCc1cc(c(O)cc1OCCCOc1ccc2c(oc3ccccc3c2=O)c1CCC(O)=O)-c1ccccc1