Reaction Details
TargetLeukotriene B4 receptor 1
LigandBDBM50029477
Substrate/Competitorn/a
Meas. Tech.ChEBML_99495
Ki 0.110000±n/a nM
Citation Sawyer, JSBaldwin, RFSofia, MJFloreancig, PMarder, PSaussy, DLFroelich, LLSilbaugh, SAStengel, PWCockerham, SL Biphenylyl-substituted xanthones: highly potent leukotriene B4 receptor antagonists. J Med Chem36:3982-4 (1994) Leukotriene B4 receptor 1
Name:Leukotriene B4 receptor 1
Type:Enzyme Catalytic Domain
Mol. Mass.:37582.68
Organism:Homo sapiens (Human)
Description:Q15722
Residue:352
BDBM50029477
NameBDBM50029477
Synonyms:5-(2-Carboxy-ethyl)-6-[3-(5-ethyl-2-hydroxy-biphenyl-4-yloxy)-propoxy]-9-oxo-9H-xanthene-2-carboxylic acid | CHEMBL340460
TypeSmall organic molecule
Emp. Form.C34H30O9
Mol. Mass.582.5966
SMILESCCc1cc(c(O)cc1OCCCOc1ccc2c(oc3ccc(cc3c2=O)C(O)=O)c1CCC(O)=O)-c1ccccc1