Reaction Details
TargetLeukotriene B4 receptor 1
LigandBDBM50029482
Substrate/Competitorn/a
Meas. Tech.ChEMBL_99495 (CHEMBL705025)
Ki 1.2±n/a nM
Citation Sawyer, JSBaldwin, RFSofia, MJFloreancig, PMarder, PSaussy, DLFroelich, LLSilbaugh, SAStengel, PWCockerham, SL Biphenylyl-substituted xanthones: highly potent leukotriene B4 receptor antagonists. J Med Chem36:3982-4 (1994) Leukotriene B4 receptor 1
Name:Leukotriene B4 receptor 1
Type:Enzyme Catalytic Domain
Mol. Mass.:37582.68
Organism:Homo sapiens (Human)
Description:Q15722
Residue:352
BDBM50029482
NameBDBM50029482
Synonyms:6-[3-(4-Acetyl-2-ethyl-5-hydroxy-phenoxy)-propoxy]-5-(2-carboxy-ethyl)-9-oxo-9H-xanthene-2-carboxylic acid LY-282210
TypeSmall organic molecule
Emp. Form.C30H28O10
Mol. Mass.548.5373
SMILESCCc1cc(C(C)=O)c(O)cc1OCCCOc1ccc2c(oc3ccc(cc3c2=O)C(O)=O)c1CCC(O)=O