Reaction Details
TargetAdenosine receptor A1
LigandBDBM50043214
Substrate/Competitorn/a
Meas. Tech.ChEMBL_29299 (CHEMBL640360)
Ki 25.3±n/a nM
Citation Peet, NPLentz, NLDudley, MWOgden, AMMcCarty, DRRacke, MM Xanthines with C8 chiral substituents as potent and selective adenosine A1 antagonists. J Med Chem36:4015-20 (1994) Adenosine receptor A1
Name:Adenosine receptor A1
Type:Protein
Mol. Mass.:36704.13
Organism:Rattus norvegicus (rat)
Description:n/a
Residue:326
BDBM50043214
NameBDBM50043214
Synonyms:8-(1-Phenyl-ethyl)-1,3-dipropyl-3,9-dihydro-purine-2,6-dione | CHEMBL128804
TypeSmall organic molecule
Emp. Form.C19H24N4O2
Mol. Mass.340.4195
SMILESCCCn1c2[nH]c(nc2c(=O)n(CCC)c1=O)[C@H](C)c1ccccc1