Reaction Details
Target5-lipoxygenase
LigandBDBM50043362
Substrate/Competitorn/a
Meas. Tech.ChEMBL_51443 (CHEMBL664363)
IC50 2000±n/a nM
Citation Müller, KGürster, DPiwek, SWiegrebe, W Antipsoriatic anthrones with modulated redox properties. 1. Novel 10-substituted 1,8-dihydroxy-9(10H)-anthracenones as inhibitors of 5-lipoxygenase. J Med Chem36:4099-107 (1994) 5-lipoxygenase
Name:5-lipoxygenase
Synonyms:Arachidonate 5-lipoxygenase
Type:PROTEIN
Mol. Mass.:49994.23
Organism:Bos taurus
Description:ChEMBL_157766
Residue:430
BDBM50043362
NameBDBM50043362
TypeSmall organic molecule
Emp. Form.C22H16O7
Mol. Mass.392.3582
SMILESOc1cccc2C(C(=O)Cc3cc(O)c(O)c(O)c3)c3cccc(O)c3C(=O)c12