Reaction Details
Target5-lipoxygenase
LigandBDBM50043355
Substrate/Competitorn/a
Meas. Tech.ChEMBL_3983 (CHEMBL619256)
IC50 600±n/a nM
Citation Müller, KGürster, DPiwek, SWiegrebe, W Antipsoriatic anthrones with modulated redox properties. 1. Novel 10-substituted 1,8-dihydroxy-9(10H)-anthracenones as inhibitors of 5-lipoxygenase. J Med Chem36:4099-107 (1994) 5-lipoxygenase
Name:5-lipoxygenase
Synonyms:Arachidonate 5-lipoxygenase
Type:PROTEIN
Mol. Mass.:49994.23
Organism:Bos taurus
Description:ChEMBL_157766
Residue:430
BDBM50043355
NameBDBM50043355
TypeSmall organic molecule
Emp. Form.C29H22O5
Mol. Mass.450.482
SMILESOc1cccc2C(C(=O)Cc3ccc(OCc4ccccc4)cc3)c3cccc(O)c3C(=O)c12