Reaction Details
TargetDihydrofolate reductase
LigandBDBM50043394
Substrate/Competitorn/a
Meas. Tech.ChEMBL_54605 (CHEMBL667327)
Ki 0.00522±n/a nM
Citation Piper, JRJohnson, CAMaddry, JAMalik, NDMcGuire, JJOtter, GMSirotnak, FM Studies on analogues of classical antifolates bearing the naphthoyl group in place of benzoyl in the side chain. J Med Chem36:4161-71 (1994) Dihydrofolate reductase
Name:Dihydrofolate reductase
Type:Enzyme
Mol. Mass.:21608.82
Organism:Mus musculus (Mouse)
Description:n/a
Residue:187
BDBM50043394
NameBDBM50043394
Synonyms:2-({4-[(2,4-Diamino-pteridin-6-ylmethyl)-methyl-amino]-naphthalene-1-carbonyl}-amino)-pentanedioic acid | CHEMBL132431
TypeSmall organic molecule
Emp. Form.C24H24N8O5
Mol. Mass.504.498
SMILESCN(Cc1cnc2nc(N)nc(N)c2n1)c1ccc(C(=O)NC(CCC(O)=O)C(O)=O)c2ccccc12