Reaction Details
TargetStromelysin-1
LigandBDBM50043582
Substrate/Competitorn/a
Meas. Tech.ChEMBL_205628 (CHEMBL812387)
Ki 6.5±n/a nM
Citation Chapman, KTKopka, IEDurette, PLEsser, CKLanza, TJIzquierdo-Martin, MNiedzwiecki, LChang, BHarrison, RKKuo, DW Inhibition of matrix metalloproteinases by N-carboxyalkyl peptides. J Med Chem36:4293-301 (1994) Stromelysin-1
Name:Stromelysin-1
Type:Enzyme
Mol. Mass.:53973.13
Organism:Homo sapiens (Human)
Description: P08254
Residue:477
BDBM50043582
NameBDBM50043582
Synonyms:1N-phenyl-2-[1-[1-amino-(1R)-ethylcarboxamido]-3-phenyl-(1S)-propylcarboxamido]-4-methyl-(2S)-pentanamide | CHEMBL422266
TypeSmall organic molecule
Emp. Form.C25H34N4O3
Mol. Mass.438.5625
SMILESCC(C)C[C@H](NC(=O)[C@H](CCc1ccccc1)NC(=O)[C@@H](C)N)C(=O)Nc1ccccc1