Reaction Details
Target3-oxo-5-alpha-steroid 4-dehydrogenase 1
LigandBDBM50043608
Substrate/Competitorn/a
Meas. Tech.ChEMBL_88441 (CHEMBL701910)
Ki 11±n/a nM
Citation Frye, SVHaffner, CDMaloney, PRMook, RADorsey, GFHiner, RNBatchelor, KWBramson, HNStuart, JDSchweiker, SL 6-Azasteroids: potent dual inhibitors of human type 1 and 2 steroid 5 alpha-reductase. J Med Chem36:4313-5 (1994) 3-oxo-5-alpha-steroid 4-dehydrogenase 1
Name:3-oxo-5-alpha-steroid 4-dehydrogenase 1
Type:Enzyme
Mol. Mass.:29472.80
Organism:Homo sapiens (Human)
Description:P18405
Residue:259
BDBM50043608
NameBDBM50043608
Synonyms:9a,11a-Dimethyl-7-oxo-2,3,3a,3b,4,5,7,8,9,9a,9b,10,11,11a-tetradecahydro-1H-cyclopenta[i]phenanthridine-1-carboxylic acid adamantan-1-ylamide | CHEMBL137733
TypeSmall organic molecule
Emp. Form.C29H42N2O2
Mol. Mass.450.656
SMILESC[C@]12CCC3C(CN=C4CC(=O)CC[C@]34C)C1CC[C@@H]2C(=O)NC12C[C@H]3C[C@H](C[C@H](C3)C1)C2