Reaction Details
TargetPolyunsaturated fatty acid 5-lipoxygenase
LigandBDBM50000829
Substrate/Competitorn/a
Meas. Tech.ChEMBL_3821 (CHEMBL618007)
IC50 27±n/a nM
Citation Lambert-van der Brempt, CBruneau, PLamorlette, MAFoster, SJ Conformational analysis of 5-lipoxygenase inhibitors: role of the substituents in chiral recognition and on the active conformations of the (methoxyalkyl)thiazole and methoxytetrahydropyran series. J Med Chem37:113-24 (1994) Polyunsaturated fatty acid 5-lipoxygenase
Name:Polyunsaturated fatty acid 5-lipoxygenase
Type:Enzyme
Mol. Mass.:77972.74
Organism:Homo sapiens (Human)
Description:Recombinant protein was purified from E. coli lysate. After ammonium sulfate precipitation and subsequent steps, the supernatant (S100) was used for 5-LO activity assay.
Residue:674
BDBM50000829
NameBDBM50000829
Synonyms:6-((3-fluoro-5-(4-methoxytetrahydro-2H-pyran-4-yl)phenoxy)methyl)-1-methylquinolin-2(1H)-one 6-[3-Fluoro-5-(tetrahydro-pyran-4-yl)-phenoxymethyl]-1-methyl-1H-quinolin-2-one ZD-2138
TypeSmall organic molecule
Emp. Form.C23H24FNO4
Mol. Mass.397.4394
SMILESCOC1(CCOCC1)c1cc(F)cc(OCc2ccc3n(C)c(=O)ccc3c2)c1