Reaction Details
TargetDelta-type opioid receptor
LigandBDBM50043717
Substrate/Competitorn/a
Meas. Tech.ChEMBL_145886 (CHEMBL754252)
IC50 0.23±n/a nM
Citation Misicka, ALipkowski, AWHorvath, RDavis, PYamamura, HIPorreca, FHruby, VJ Design of cyclic deltorphins and dermenkephalins with a disulfide bridge leads to analogues with high selectivity for delta-opioid receptors. J Med Chem37:141-5 (1994) Delta-type opioid receptor
Name:Delta-type opioid receptor
Type:Enzyme Catalytic Domain
Mol. Mass.:40577.25
Organism:MOUSE
Description:P32300
Residue:372
BDBM50043717
NameBDBM50043717
Synonyms:CHEMBL289006 | {(4S,7R,10S,13R)-13-[(S)-2-Amino-3-(4-hydroxy-phenyl)-propionylamino]-10-benzyl-4-[(R)-1-(carbamoylmethyl-carbamoyl)-2-methyl-propylcarbamoyl]-6,9,12-trioxo-1,2-dithia-5,8,11-triaza-cyclotetradec-7-yl}-acetic acid
TypeSmall organic molecule
Emp. Form.C35H46N8O10S2
Mol. Mass.802.917
SMILESCC(C)[C@@H](NC(=O)[C@H]1CSSC[C@H](NC(=O)[C@@H](N)Cc2ccc(O)cc2)C(=O)N[C@@H](Cc2ccccc2)C(=O)N[C@H](CC(O)=O)C(=O)N1)C(=O)NCC(N)=O