Reaction Details
TargetGlutathione S-transferase Mu 2
LigandBDBM50043761
Substrate/Competitorn/a
Meas. Tech.ChEMBL_72449 (CHEMBL682619)
Ki 42000±n/a nM
Citation Lyttle, MHHocker, MDHui, HCCaldwell, CGAaron, DTEngqvist-Goldstein, AFlatgaard, JEBauer, KE Isozyme-specific glutathione-S-transferase inhibitors: design and synthesis. J Med Chem37:189-94 (1994) Glutathione S-transferase Mu 2
Name:Glutathione S-transferase Mu 2
Type:PROTEIN
Mol. Mass.:25743.85
Organism:Homo sapiens (Human)
Description:ChEMBL_1441153
Residue:218
BDBM50043761
NameBDBM50043761
Synonyms:2-Amino-4-[1-(2-carboxy-ethylcarbamoyl)-2-hexylsulfanyl-ethylcarbamoyl]-butyric acid | CHEMBL60581
TypeSmall organic molecule
Emp. Form.C17H31N3O6S
Mol. Mass.405.51
SMILESCCCCCCSCC(NC(=O)CCC(N)C(O)=O)C(=O)NCCC(O)=O