Reaction Details
TargetGlutathione S-transferase A1
LigandBDBM50043763
Substrate/Competitorn/a
Meas. Tech.ChEMBL_72446 (CHEMBL682616)
Ki 43000±n/a nM
Citation Lyttle, MHHocker, MDHui, HCCaldwell, CGAaron, DTEngqvist-Goldstein, AFlatgaard, JEBauer, KE Isozyme-specific glutathione-S-transferase inhibitors: design and synthesis. J Med Chem37:189-94 (1994) Glutathione S-transferase A1
Name:Glutathione S-transferase A1
Type:Enzyme
Mol. Mass.:25636.31
Organism:Homo sapiens (Human)
Description:Glutathione-S-Transferase (GST, N-terminally)
Residue:222
BDBM50043763
NameBDBM50043763
Synonyms:2-Amino-4-[1-(2-carboxy-ethylcarbamoyl)-2-(4-methyl-benzylsulfanyl)-ethylcarbamoyl]-butyric acid | CHEMBL301229
TypeSmall organic molecule
Emp. Form.C19H27N3O6S
Mol. Mass.425.499
SMILESCc1ccc(CSCC(NC(=O)CCC(N)C(O)=O)C(=O)NCCC(O)=O)cc1