Reaction Details
TargetGlutathione S-transferase Mu 1
LigandBDBM50043762
Substrate/Competitorn/a
Meas. Tech.ChEMBL_72448 (CHEMBL682618)
Ki 57800±n/a nM
Citation Lyttle, MHHocker, MDHui, HCCaldwell, CGAaron, DTEngqvist-Goldstein, AFlatgaard, JEBauer, KE Isozyme-specific glutathione-S-transferase inhibitors: design and synthesis. J Med Chem37:189-94 (1994) Glutathione S-transferase Mu 1
Name:Glutathione S-transferase Mu 1
Type:PROTEIN
Mol. Mass.:25712.03
Organism:Homo sapiens (Human)
Description:ChEMBL_799596
Residue:218
BDBM50043762
NameBDBM50043762
Synonyms:2-Amino-4-{2-benzylsulfanyl-1-[(carboxy-phenyl-methyl)-carbamoyl]-ethylcarbamoyl}-butyric acid | CHEMBL58951
TypeSmall organic molecule
Emp. Form.C23H27N3O6S
Mol. Mass.473.542
SMILESNC(CCC(=O)NC(CSCc1ccccc1)C(=O)NC(C(O)=O)c1ccccc1)C(O)=O