Reaction Details
TargetGlutathione S-transferase A1
LigandBDBM50043758
Substrate/Competitorn/a
Meas. Tech.ChEMBL_72446 (CHEMBL682616)
Ki 840.0±n/a nM
Citation Lyttle, MHHocker, MDHui, HCCaldwell, CGAaron, DTEngqvist-Goldstein, AFlatgaard, JEBauer, KE Isozyme-specific glutathione-S-transferase inhibitors: design and synthesis. J Med Chem37:189-94 (1994) Glutathione S-transferase A1
Name:Glutathione S-transferase A1
Type:Enzyme
Mol. Mass.:25636.31
Organism:Homo sapiens (Human)
Description:Glutathione-S-Transferase (GST, N-terminally)
Residue:222
BDBM50043758
NameBDBM50043758
Synonyms:2-Amino-4-[1-(carboxymethyl-carbamoyl)-2-hexylsulfanyl-ethylcarbamoyl]-butyric acid | CHEMBL58135
TypeSmall organic molecule
Emp. Form.C16H29N3O6S
Mol. Mass.391.483
SMILESCCCCCCSCC(NC(=O)CCC(N)C(O)=O)C(=O)NCC(O)=O