Reaction Details
TargetEndothelin-1 receptor
LigandBDBM50034435
Substrate/Competitorn/a
Meas. Tech.ChEMBL_63373 (CHEMBL676109)
Ki>200000±n/a nM
Citation Stein, PDHunt, JTFloyd, DMMoreland, SDickinson, KEMitchell, CLiu, ECWebb, MLMurugesan, NDickey, J The discovery of sulfonamide endothelin antagonists and the development of the orally active ETA antagonist 5-(dimethylamino)-N-(3,4-dimethyl-5-isoxazolyl)-1-naphthalenesulf onamide. J Med Chem37:329-31 (1994) Endothelin-1 receptor
Name:Endothelin-1 receptor
Type:Enzyme Catalytic Domain
Mol. Mass.:48256.91
Organism:RAT
Description:ENDOTHELIN A EDNRA RAT::P26684
Residue:426
BDBM50034435
NameBDBM50034435
Synonyms:5-Dimethylamino-naphthalene-1-sulfonic acid (3,4-dimethyl-2,3-dihydro-oxazol-5-yl)-amide 5-Dimethylamino-naphthalene-1-sulfonic acid (3,4-dimethyl-isoxazol-5-yl)-amide (BMS 182874) CHEMBL267458
TypeSmall organic molecule
Emp. Form.C17H19N3O3S
Mol. Mass.345.416
SMILESCN(C)c1cccc2c(cccc12)S(=O)(=O)Nc1onc(C)c1C