Reaction Details
TargetRetinoic acid receptor RXR-gamma
LigandBDBM50044098
Substrate/Competitorn/a
Meas. Tech.ChEMBL_196654 (CHEMBL800767)
IC50 10±n/a nM
Citation Boehm, MFMcClurg, MRPathirana, CMangelsdorf, DWhite, SKHebert, JWinn, DGoldman, MEHeyman, RA Synthesis of high specific activity [3H]-9-cis-retinoic acid and its application for identifying retinoids with unusual binding properties. J Med Chem37:408-14 (1994) Retinoic acid receptor RXR-gamma
Name:Retinoic acid receptor RXR-gamma
Type:PROTEIN
Mol. Mass.:50878.26
Organism:Homo sapiens (Human)
Description:ChEMBL_197216
Residue:463
BDBM50044098
NameBDBM50044098
Synonyms:4-[(E)-2-(3-Isopropyl-5,5,8,8-tetramethyl-5,6,7,8-tetrahydro-naphthalen-2-yl)-propenyl]-benzoic acid | CHEMBL424636
TypeSmall organic molecule
Emp. Form.C27H34O2
Mol. Mass.390.5577
SMILESCC(C)c1cc2c(cc1\C(C)=C\c1ccc(cc1)C(O)=O)C(C)(C)CCC2(C)C