Reaction Details
TargetRetinoic acid receptor RXR-alpha
LigandBDBM50032221
Substrate/Competitorn/a
Meas. Tech.ChEMBL_196500 (CHEMBL798314)
IC50 32±n/a nM
Citation Boehm, MFMcClurg, MRPathirana, CMangelsdorf, DWhite, SKHebert, JWinn, DGoldman, MEHeyman, RA Synthesis of high specific activity [3H]-9-cis-retinoic acid and its application for identifying retinoids with unusual binding properties. J Med Chem37:408-14 (1994) Retinoic acid receptor RXR-alpha
Name:Retinoic acid receptor RXR-alpha
Type:PROTEIN
Mol. Mass.:50820.38
Organism:Homo sapiens (Human)
Description:ChEMBL_1456363
Residue:462
BDBM50032221
NameBDBM50032221
Synonyms:4-[(E)-2-(3,5,5,8,8-Pentamethyl-5,6,7,8-tetrahydro-naphthalen-2-yl)-propenyl]-benzoic acid | CHEMBL32505
TypeSmall organic molecule
Emp. Form.C25H30O2
Mol. Mass.362.5045
SMILESC\C(=C/c1ccc(cc1)C(O)=O)c1cc2c(cc1C)C(C)(C)CCC2(C)C