Reaction Details
TargetRetinoic acid receptor alpha
LigandBDBM31892
Substrate/Competitorn/a
Meas. Tech.ChEMBL_195316 (CHEMBL799871)
IC50 7±n/a nM
Citation Boehm, MFMcClurg, MRPathirana, CMangelsdorf, DWhite, SKHebert, JWinn, DGoldman, MEHeyman, RA Synthesis of high specific activity [3H]-9-cis-retinoic acid and its application for identifying retinoids with unusual binding properties. J Med Chem37:408-14 (1994) Retinoic acid receptor alpha
Name:Retinoic acid receptor alpha
Type:PROTEIN
Mol. Mass.:50778.87
Organism:Homo sapiens (Human)
Description:ChEMBL_1466191
Residue:462
BDBM31892
NameBDBM31892
Synonyms:9-cis retinoic acid CHEMBL705 alitretinoin
TypeSmall organic molecule
Emp. Form.C20H28O2
Mol. Mass.300.4351
SMILESC\C(\C=C\C1=C(C)CCCC1(C)C)=C\C=C\C(\C)=C\C(O)=O