Reaction Details
Target5-hydroxytryptamine receptor 1A
LigandBDBM50035320
Substrate/Competitorn/a
Meas. Tech.ChEBML_1203
Ki 1.3±n/a nM
Citation Stjernlöf, PGullme, MElebring, TAndersson, BWikström, HLagerquist, SSvensson, KEkman, ACarlsson, ASundell, S (S)- and (R)-8-(di-n-propylamino)-6,7,8,9-tetrahydro-3H-benz[e]indole-1- carbaldehyde: a new class of orally active 5-HT1A-receptor agonists. J Med Chem36:2059-65 (1993) 5-hydroxytryptamine receptor 1A
Name:5-hydroxytryptamine receptor 1A
Type:G Protein-Coupled Receptor (GPCR)
Mol. Mass.:46445.29
Organism:Rattus norvegicus (rat)
Description:Binding assays were performed using rat hippocampal membranes.
Residue:422
BDBM50035320
NameBDBM50035320
Synonyms:(+/-)-8-Dipropylamino-6,7,8,9-tetrahydro-3H-benzo[e]indole-1-carbaldehyde CHEMBL304426
TypeSmall organic molecule
Emp. Form.C19H26N2O
Mol. Mass.298.4225
SMILESCCCN(CCC)C1CCc2ccc3[nH]cc(C=O)c3c2C1