Reaction Details
Target5-hydroxytryptamine receptor 1A
LigandBDBM50044237
Substrate/Competitorn/a
Meas. Tech.ChEBML_1203
Ki 1.4±n/a nM
Citation Stjernlöf, PGullme, MElebring, TAndersson, BWikström, HLagerquist, SSvensson, KEkman, ACarlsson, ASundell, S (S)- and (R)-8-(di-n-propylamino)-6,7,8,9-tetrahydro-3H-benz[e]indole-1- carbaldehyde: a new class of orally active 5-HT1A-receptor agonists. J Med Chem36:2059-65 (1993) 5-hydroxytryptamine receptor 1A
Name:5-hydroxytryptamine receptor 1A
Type:G Protein-Coupled Receptor (GPCR)
Mol. Mass.:46445.29
Organism:Rattus norvegicus (rat)
Description:Binding assays were performed using rat hippocampal membranes.
Residue:422
BDBM50044237
NameBDBM50044237
Synonyms:CHEMBL65274 | R-(+)-1-(8-Dipropylamino-6,7,8,9-tetrahydro-3H-benzo[e]indol-1-yl)-ethanone
TypeSmall organic molecule
Emp. Form.C20H28N2O
Mol. Mass.312.4491
SMILESCCCN(CCC)[C@@H]1CCc2ccc3[nH]cc(C(C)=O)c3c2C1