Reaction Details
Target5-hydroxytryptamine receptor 1A
LigandBDBM50016777
Substrate/Competitorn/a
Meas. Tech.ChEMBL_1204 (CHEMBL615970)
Ki 3.1±n/a nM
Citation Stjernlöf, PGullme, MElebring, TAndersson, BWikström, HLagerquist, SSvensson, KEkman, ACarlsson, ASundell, S (S)- and (R)-8-(di-n-propylamino)-6,7,8,9-tetrahydro-3H-benz[e]indole-1- carbaldehyde: a new class of orally active 5-HT1A-receptor agonists. J Med Chem36:2059-65 (1993) 5-hydroxytryptamine receptor 1A
Name:5-hydroxytryptamine receptor 1A
Type:G Protein-Coupled Receptor (GPCR)
Mol. Mass.:46445.29
Organism:Rattus norvegicus (rat)
Description:Binding assays were performed using rat hippocampal membranes.
Residue:422
BDBM50016777
NameBDBM50016777
Synonyms:((R)-8-Hydroxy-1,2,3,4-tetrahydro-naphthalen-2-yl)-dipropyl-ammonium (R)-7-Dipropylamino-5,6,7,8-tetrahydro-naphthalen-1-ol 7-Dipropylamino-5,6,7,8-tetrahydro-naphthalen-1-ol ((R)-OH-DPAT) CHEMBL26998 | R-(+)-7-Dipropylamino-5,6,7,8-tetrahydro-naphthalen-1-ol
TypeSmall organic molecule
Emp. Form.C16H25NO
Mol. Mass.247.3758
SMILESCCCN(CCC)[C@@H]1CCc2cccc(O)c2C1