Reaction Details
TargetCarbonic anhydrase 1/2/5B, mitochondrial
LigandBDBM50044318
Substrate/Competitorn/a
Meas. Tech.ChEMBL_47315 (CHEMBL661386)
IC50 1000000±n/a nM
Citation Scholz, THSondey, JMRandall, WCSchwam, HThompson, WJMallorga, PJSugrue, MFGraham, SL Sulfonylmethanesulfonamide inhibitors of carbonic anhydrase. J Med Chem36:2134-41 (1993) Carbonic anhydrase 1/2/5B, mitochondrial
Name:Carbonic anhydrase 1/2/5B, mitochondrial
Synonyms:Carbonic anhydrase I
Type:n/a
Mol. Mass.:n/a
Description:ASSAY_ID of EBI is 47315
Components:This complex has 2 components.
Component 1
Name:Carbonic anhydrase 2
Type:Enzyme
Mol. Mass.:29250.71
Organism:Homo sapiens (Human)
Description:P00918
Residue:260
Component 2
Name:Carbonic anhydrase 1
Synonyms:CA-I CAB Carbonate dehydratase I Carbonic anhydrase 1 (CA I) Carbonic anhydrase 1 (Recombinant CA I) Carbonic anhydrase B Carbonic anhydrase I (CA I) Carbonic anhydrase I (CAI) Carbonic anhydrase isoenzyme I (hCA I) | hCA
Type:Enzyme
Mol. Mass.:28873.37
Organism:Homo sapiens (Human)
Description:P00915
Residue:261
Component 3
Name:Carbonic anhydrase 5B, mitochondrial
Synonyms:CA-VB CAH5B_HUMAN Carbonic Anhydrase VB Carbonic anhydrase 5B, mitochondrial Carbonic anhydrase V | Carbonic anhydrase VB (CA VB)
Type:Enzyme
Mol. Mass.:36440.83
Organism:Homo sapiens (Human)
Description:Human (cloned) isozyme
Residue:317
BDBM50044318
NameBDBM50044318
Synonyms:CHEMBL305268 aminosulfane dioxide
TypeSmall organic molecule
Emp. Form.CH5NO2S
Mol. Mass.95.121
SMILESCS(N)(=O)=O