Reaction Details
TargetType-1 angiotensin II receptor B
LigandBDBM50044366
Substrate/Competitorn/a
Meas. Tech.ChEBML_34826
IC50 10±n/a nM
Citation Huang, HCReitz, DBChamberlain, TSOlins, GMCorpus, VMMcMahon, EGPalomo, MAKoepke, JPSmits, GJMcGraw, DE Synthesis and structure-activity relationships of nonpeptide, potent triazolone-based angiotensin II receptor antagonists. J Med Chem36:2172-81 (1993) Type-1 angiotensin II receptor B
Name:Type-1 angiotensin II receptor B
Type:Enzyme Catalytic Domain
Mol. Mass.:40929.44
Organism:RAT
Description:Angiotensin II AT1B 0 RAT::P29089
Residue:359
BDBM50044366
NameBDBM50044366
Synonyms:5-Butyl-2-sec-butyl-4-[2'-(1H-tetrazol-5-yl)-biphenyl-4-ylmethyl]-2,4-dihydro-[1,2,4]triazol-3-one CHEMBL87964
TypeSmall organic molecule
Emp. Form.C24H29N7O
Mol. Mass.431.5334
SMILESCCCCc1nn(C(C)CC)c(=O)n1Cc1ccc(cc1)-c1ccccc1-c1nnn[nH]1