Reaction Details
TargetLanosterol 14-alpha demethylase
LigandBDBM31768
Substrate/Competitorn/a
Meas. Tech.ChEMBL_218500 (CHEMBL824123)
Ki 64±n/a nM
Citation Walker, KAKertesz, DJRotstein, DMSwinney, DCBerry, PWSo, OYWebb, ASWatson, DMMak, AYBurton, PM Selective inhibition of mammalian lanosterol 14 alpha-demethylase: a possible strategy for cholesterol lowering. J Med Chem36:2235-7 (1993) Lanosterol 14-alpha demethylase
Name:Lanosterol 14-alpha demethylase
Type:Protein
Mol. Mass.:56817.21
Organism:Homo sapiens (Human)
Description:Q16850
Residue:503
BDBM31768
NameBDBM31768
Synonyms:CHEMBL295698 Nizoral | Panfungol
TypeSmall organic molecule
Emp. Form.C26H28Cl2N4O4
Mol. Mass.531.431
SMILESCC(=O)N1CCN(CC1)c1ccc(OC[C@@H]2CO[C@](Cn3ccnc3)(O2)c2ccc(Cl)cc2Cl)cc1