Reaction Details
TargetLanosterol 14-alpha demethylase
LigandBDBM31653
Substrate/Competitorn/a
Meas. Tech.ChEBML_96762
Ki 117±n/a nM
Citation Walker, KAKertesz, DJRotstein, DMSwinney, DCBerry, PWSo, OYWebb, ASWatson, DMMak, AYBurton, PM Selective inhibition of mammalian lanosterol 14 alpha-demethylase: a possible strategy for cholesterol lowering. J Med Chem36:2235-7 (1993) Lanosterol 14-alpha demethylase
Name:Lanosterol 14-alpha demethylase
Type:PROTEIN
Mol. Mass.:56717.47
Organism:Rattus norvegicus
Description:ChEMBL_52075
Residue:503
BDBM31653
NameBDBM31653
Synonyms:CHEMBL421109 | imidazole-dioxolane, 5
TypeSmall organic molecule
Emp. Form.C22H24ClN3O2S
Mol. Mass.429.963
SMILESNc1ccc(SC[C@@H]2CO[C@@](CCc3ccc(Cl)cc3)(Cn3ccnc3)O2)cc1