Reaction Details
TargetSerotonin 2 (5-HT2) receptor
LigandBDBM50044453
Substrate/Competitorn/a
Meas. Tech.ChEBML_2396
Ki 8±n/a nM
Citation Ismaiel, AMDe Los Angeles, JTeitler, MIngher, SGlennon, RA Antagonism of 1-(2,5-dimethoxy-4-methylphenyl)-2-aminopropane stimulus with a newly identified 5-HT2- versus 5-HT1C-selective antagonist. J Med Chem36:2519-25 (1993) Serotonin 2 (5-HT2) receptor
Name:Serotonin 2 (5-HT2) receptor
Synonyms:5-hydroxytryptamine receptor 2A/2B/2C
Type:n/a
Mol. Mass.:n/a
Description:ASSAY_ID of ChEMBL is 2197419
Components:This complex has 3 components.
Component 1
Name:5-hydroxytryptamine receptor 2B
Type:Enzyme Catalytic Domain
Mol. Mass.:53668.47
Organism:RAT
Description:5-HT2B HTR2B RAT::P30994
Residue:479
Component 2
Name:5-hydroxytryptamine receptor 2C
Synonyms:5-HT2C 5-hydroxytryptamine receptor 2C (5HT2c) 5ht1c Htr2c Serotonin receptor 2a and 2c (5HT2A and 5HT2C)
Type:Enzyme
Mol. Mass.:51935.10
Organism:Rattus norvegicus (Rat)
Description:P08909
Residue:460
Component 3
Name:5-hydroxytryptamine receptor 2A
Synonyms:5-HT-2A 5-HT2A 5-hydroxytryptamine receptor 2A (5HT2A) Htr2 Serotonin Receptor 2A
Type:G Protein-Coupled Receptor (GPCR)
Mol. Mass.:52852.05
Organism:Rattus norvegicus (rat)
Description:Rat cortex membranes 5-HT2A receptors.
Residue:471
BDBM50044453
NameBDBM50044453
Synonyms:CHEMBL86072 | {1-[3-(4-Fluoro-phenoxy)-propyl]-piperidin-4-yl}-(4-fluoro-phenyl)-methanone
TypeSmall organic molecule
Emp. Form.C21H23F2NO2
Mol. Mass.359.4096
SMILESFc1ccc(OCCCN2CCC(CC2)C(=O)c2ccc(F)cc2)cc1