Reaction Details
TargetNeprilysin
LigandBDBM50024096
Substrate/Competitorn/a
Meas. Tech.ChEBML_144621
Ki 2±n/a nM
Citation Flynn, GABeight, DWMehdi, SKoehl, JRGiroux, ELFrench, JFHake, PWDage, RC Application of a conformationally restricted Phe-Leu dipeptide mimetic to the design of a combined inhibitor of angiotensin I-converting enzyme and neutral endopeptidase 24.11. J Med Chem36:2420-3 (1993) Neprilysin
Name:Neprilysin
Type:Protein
Mol. Mass.:85789.59
Organism:Rattus norvegicus (Rat)
Description:P07861
Residue:750
BDBM50024096
NameBDBM50024096
Synonyms:((R)-2-Mercaptomethyl-3-phenyl-propionylamino)-acetic acid (R) (2-Mercaptomethyl-3-phenyl-propionylamino)-acetic acid | CHEMBL61512
TypeSmall organic molecule
Emp. Form.C12H15NO3S
Mol. Mass.253.317
SMILESOC(=O)CNC(=O)[C@H](CS)Cc1ccccc1